{"text_format":"1","workbook":"xlsx","n_sheets":6,"sheets":["Marschtabelle","Wetter- & Lawinenlage","130-Tage-Temperaturverlauf","30-Tage-Temperaturverlauf","Nebenrechnungen","Wegpunkte"],"not_rendered":{"charts":10,"images":0,"macros":1,"external_links":0,"defined_names":7,"comments":0,"pivot_tables":0},"unopened":[],"bounds":{"document_bytes":16777216,"sheet_cells":100000,"rows_first":2000,"rows_last":500,"rows_between":2000,"halvings":0,"cell_chars":16384,"cell_head_chars":4096},"cells_cut":0,"cells_raw":0,"read":"whole","date_system":"1900"}

{"sheet":"Marschtabelle","index":0,"n_rows":42,"n_cols":27,"rows_kept":42,"cut":false,"hidden":false,"merged":[[19,5,20,5],[21,5,22,5],[11,1,12,3],[13,1,14,3],[17,1,18,3],[9,5,10,5],[11,5,12,5],[13,5,14,5],[15,5,16,5],[17,5,18,5],[9,1,10,3],[12,14,12,15],[14,14,14,15],[9,14,9,15],[6,14,6,15],[7,14,7,15],[8,14,8,15],[5,14,5,17],[24,9,25,9],[18,22,18,23],[16,12,17,12],[18,9,19,9],[20,22,20,23],[22,22,22,23],[24,22,24,23],[11,16,12,17],[9,20,9,25],[24,12,25,12],[16,13,17,13],[12,13,13,13],[1,22,1,23],[1,19,1,20],[22,12,23,12],[22,13,23,13],[20,13,21,13],[7,21,8,21],[1,12,1,13],[3,18,3,20],[0,25,0,26],[0,18,0,23],[6,12,7,12],[18,13,19,13],[17,16,18,17],[19,16,20,17],[13,16,14,17],[8,12,9,12],[14,12,15,12],[14,13,15,13],[21,16,22,17],[6,16,8,17],[5,13,7,13],[15,16,16,17],[10,13,11,13],[10,14,10,15],[7,26,8,26],[5,18,5,25],[2,18,2,20],[7,18,8,18],[10,22,10,23],[7,20,8,20],[7,19,8,19],[7,22,8,23],[7,25,8,25],[35,16,36,17],[34,13,35,13],[34,22,34,23],[33,16,34,17],[36,22,36,23],[38,21,38,25],[29,16,30,17],[31,16,32,17],[30,22,30,23],[37,16,37,26],[35,14,35,15],[30,14,30,15],[34,14,34,15],[45,23,45,24],[28,9,29,9],[30,13,31,13],[30,12,31,12],[32,22,32,23],[31,1,32,3],[26,13,27,13],[35,1,36,3],[33,1,34,3],[32,9,33,9],[38,16,38,19],[39,16,39,19],[27,16,28,17],[34,12,35,12],[41,0,41,26],[34,9,35,9],[27,5,28,5],[29,5,30,5],[31,5,32,5],[33,5,34,5],[35,5,36,5],[39,21,39,25],[32,14,32,15],[28,22,28,23],[32,12,33,12],[39,0,39,2],[38,0,38,2],[32,13,33,13],[29,1,30,3],[20,12,21,12],[22,9,23,9],[39,5,39,6],[39,8,39,10],[38,5,38,6],[38,8,38,10],[23,1,24,3],[21,1,22,3],[38,12,38,14],[39,12,39,14],[29,14,29,15],[31,14,31,15],[33,14,33,15],[27,14,27,15],[28,12,29,12],[27,1,28,3],[30,9,31,9],[37,0,37,7],[25,1,26,3],[26,9,27,9],[23,5,24,5],[25,5,26,5],[6,9,7,9],[6,10,7,11],[20,9,21,9],[28,14,28,15],[25,14,25,15],[0,6,0,8],[5,8,5,9],[7,5,8,5],[0,12,0,17],[9,16,10,17],[24,13,25,13],[28,13,29,13],[26,12,27,12],[22,14,22,15],[24,14,24,15],[26,14,26,15],[21,14,21,15],[23,14,23,15],[23,16,24,17],[25,16,26,17],[1,14,1,17],[0,9,0,11],[0,3,0,5],[0,0,0,1],[3,6,3,8],[5,7,6,7],[5,10,5,11],[1,0,1,5],[1,6,1,8],[3,4,3,5],[5,0,5,4],[2,9,3,10],[1,9,1,11],[7,1,8,3],[2,3,2,6],[18,12,19,12],[10,12,11,12],[12,12,13,12],[15,1,16,3],[19,1,20,3],[11,14,11,15],[13,14,13,15],[8,13,9,13],[18,14,18,15],[20,14,20,15],[19,14,19,15],[15,14,15,15],[17,14,17,15],[16,14,16,15],[3,0,3,1],[6,1,6,3],[3,14,3,17],[16,9,17,9],[14,9,15,9],[12,9,13,9],[10,9,11,9],[8,9,9,9],[27,20,27,25],[29,20,29,25],[31,20,31,25],[33,20,33,25],[35,20,35,25],[6,20,6,25],[11,20,11,25],[13,20,13,25],[15,20,15,25],[17,20,17,25],[19,20,19,25],[21,20,21,25],[23,20,23,25],[25,20,25,25],[26,22,26,23],[12,22,12,23],[14,22,14,23],[16,22,16,23]]}
["Seite:",null,1,"/ Skitour von:",null,null,"nach:",null,null,"Datum:",null,null,"Aufstiegs- & Abfahrtsparameter (m)",null,null,null,null,null,"Maßstab- & Steigungsrechner",null,null,null,null,null,null,"LWS"]
[null,null,null,null,null,null,null,null,null,null,null,null,"Aufstieg ä",null,"Abfahrt æ",null,null,null,"1:",25000,null,"Distanz","Steigung",null,null,"oberhalb:",{"$f":"'Wetter- & Lawinenlage'!P31","v":3}]
[null,null,null,"GPS-Höhenkorrektur (+/-):",null,null,null,10,"m","Sonnenauf- & \n-untergang",null,null,"Hm/h","m/h","=","1/",3,null,"Kartenstrecke / cm:",null,null,1,"Hm:",100,null,{"$f":"'Wetter- & Lawinenlage'!$E$34","v":1800},"m ü. NN"]
["Start:",null,null,"Ende:",null,null,null,null,null,null,null,null,350,4000,"der Aufstiegszeit",null,null,null,"reale Strecke / m:",null,null,{"$f":"$T$2*$V$3/100","v":250},{"$f":"IF($X$3=\"\",\"\",DEGREES(ATAN($X$3/$V$4)))","v":21.801409486351812},{"$f":"IF(X3=\"\",\"\",\"°\")","v":"°"},null,"unterhalb:",{"$f":"'Wetter- & Lawinenlage'!S39","v":2}]
[]
["Wegpunkte",null,null,null,null,null,"GPS","Höhe\nKarte \nGPS","Marschrichtung",null,"Weg (m)",null,50,"Höhen-diffe-renz","Gehzeit",null,null,null,"Anmkerkungen (* in Restrisiko eingerechnet)"]
["lfd. Nr.","Bezeichnung",null,null,"( )*","Pausen-\nzeit","Länge O\nBreite N",null,"hin","Hilfsziel","Karte\nGPS",null,"m-\nSeil-\nlängen",null,"Weg-stück",null,"Uhrzeit gem. Plan",null,"Rest-\nrisiko","Inkl.*\nHang","Anmerkung zur Entscheidung \nüber Weg von WP(n) nach WP(n+1)",null,null,null,null,null,"POI"]
["WP","Ausgangspunkt / Hütte oder Parkplatz",null,null,null,null,null,null,"rück",null,null,null,null,null,"Zeit",null,null,null,"Gefahr-\nHöhe*","Inkl.*\nWeg","Expo-sitio.*","Gefahren-\nstelle*","Anmer-kung",null,null,"befah-ren*","|<Ab-\nstand>|*"]
[null,null,null,null,null,null,null,null,null,null,null,null,{"$f":"IF(L9=\"\",\"\",L9/$M$6)","v":""},{"$f":"IF(H10=\"\",\"\",H10-H8)","v":""},{"$f":"IF(N9=\"\",\"\",IF(N9>=0,IF(L9/$N$4*60>N9/$M$4*60,(L9/$N$4*60+N9/$M$4*30)/1440,(L9/$N$4*30+N9/$M$4*60)/1440),(IF(L9/$N$4*60>-(N9/$M$4*60),(L9/$N$4*60-N9/$M$4*30)/1440,(L9/$N$4*30-N9/$M$4*60)/1440)/$Q$3)))","v":""}]
["WP",null,null,null,null,null,null,null,{"$f":"IF(I9=\"\",\"\",IF(I9>=180,I9-180,I9+180))","v":""},null,null,{"$f":"Nebenrechnungen!AA72","v":""},null,null,{"$f":"IF(AND(O9=\"\",F8=\"\"),\"\",SUM(O9,F8))","v":""},null,{"$f":"IF($C$4=\"\",\"\",IF(O10=\"\",\"\",$C$4+O10))","v":""},null,{"$f":"IF(AND(S11=\"\",W11=\"\",T11=\"\",U11=\"\",V11=\"\",Z11=\"\",AA11=\"\"),\"\",IF(AND(W11=\"\",T11=\"\",U11=\"\",V11=\"\",Z11=\"\",AA11=\"\"),\"?\",IF(AND(T11=\"\",U11=\"\",V11=\"\",Z11=\"\",AA11=\"\"),VLOOKUP(W11,Nebenrechnungen!$AB$1:$AC$12,2,FALSE),IF(OR(V11=\"Hang\",V11=\"\"),Nebenrechnungen!V14,IF(VLOOKUP(V11,Nebenrechnungen!$H$3:$J$10,2,FALSE)=TRUE,VLOOKUP(V11,Nebenrechnungen!$H$3:$J$10,3,FALSE),Nebenrechnungen!V14)))))","v":""},null,null,null,null,null,null,null,{"$f":"IF(OR(S10<=1,S10=\"\",S10=\"?\",S10=\"WP\"),\"\",\"!\")","v":""}]
[null,null,null,null,null,null,null,null,null,null,null,null,{"$f":"IF(L11=\"\",\"\",L11/$M$6)","v":""},{"$f":"IF(H12=\"\",\"\",H12-H10)","v":""},{"$f":"IF(N11=\"\",\"\",IF(N11>=0,IF(L11/$N$4*60>N11/$M$4*60,(L11/$N$4*60+N11/$M$4*30)/1440,(L11/$N$4*30+N11/$M$4*60)/1440),(IF(L11/$N$4*60>-(N11/$M$4*60),(L11/$N$4*60-N11/$M$4*30)/1440,(L11/$N$4*30-N11/$M$4*60)/1440)/$Q$3)))","v":""}]
["WP",null,null,null,null,null,null,null,{"$f":"IF(I11=\"\",\"\",IF(I11>=180,I11-180,I11+180))","v":""},null,null,{"$f":"Nebenrechnungen!AA73","v":""},null,null,{"$f":"IF(AND(O11=\"\",F10=\"\"),\"\",SUM($O$10,$O$11,F10))","v":""},null,{"$f":"IF($C$4=\"\",\"\",IF(O12=\"\",\"\",$C$4+O12))","v":""},null,{"$f":"IF(AND(S13=\"\",W13=\"\",T13=\"\",U13=\"\",V13=\"\",Z13=\"\",AA13=\"\"),\"\",IF(AND(W13=\"\",T13=\"\",U13=\"\",V13=\"\",Z13=\"\",AA13=\"\"),\"?\",IF(AND(T13=\"\",U13=\"\",V13=\"\",Z13=\"\",AA13=\"\"),VLOOKUP(W13,Nebenrechnungen!$AB$1:$AC$12,2,FALSE),IF(OR(V13=\"Hang\",V13=\"\"),Nebenrechnungen!V15,IF(VLOOKUP(V13,Nebenrechnungen!$H$3:$J$10,2,FALSE)=TRUE,VLOOKUP(V13,Nebenrechnungen!$H$3:$J$10,3,FALSE),Nebenrechnungen!V15)))))","v":""},null,null,null,null,null,null,null,{"$f":"IF(OR(S12<=1,S12=\"\",S12=\"?\",S12=\"WP\"),\"\",\"!\")","v":""}]
[null,null,null,null,null,null,null,null,null,null,null,null,{"$f":"IF(L13=\"\",\"\",L13/$M$6)","v":""},{"$f":"IF(H14=\"\",\"\",H14-H12)","v":""},{"$f":"IF(N13=\"\",\"\",IF(N13>=0,IF(L13/$N$4*60>N13/$M$4*60,(L13/$N$4*60+N13/$M$4*30)/1440,(L13/$N$4*30+N13/$M$4*60)/1440),(IF(L13/$N$4*60>-(N13/$M$4*60),(L13/$N$4*60-N13/$M$4*30)/1440,(L13/$N$4*30-N13/$M$4*60)/1440)/$Q$3)))","v":""}]
["WP",null,null,null,null,null,null,null,{"$f":"IF(I13=\"\",\"\",IF(I13>=180,I13-180,I13+180))","v":""},null,null,{"$f":"Nebenrechnungen!AA74","v":""},null,null,{"$f":"IF(O13=\"\",\"\",SUM($O$12,$O$13,F12))","v":""},null,{"$f":"IF($C$4=\"\",\"\",IF(O14=\"\",\"\",$C$4+O14))","v":""},null,{"$f":"IF(AND(S15=\"\",W15=\"\",T15=\"\",U15=\"\",V15=\"\",Z15=\"\",AA15=\"\"),\"\",IF(AND(W15=\"\",T15=\"\",U15=\"\",V15=\"\",Z15=\"\",AA15=\"\"),\"?\",IF(AND(T15=\"\",U15=\"\",V15=\"\",Z15=\"\",AA15=\"\"),VLOOKUP(W15,Nebenrechnungen!$AB$1:$AC$12,2,FALSE),IF(OR(V15=\"Hang\",V15=\"\"),Nebenrechnungen!V16,IF(VLOOKUP(V15,Nebenrechnungen!$H$3:$J$10,2,FALSE)=TRUE,VLOOKUP(V15,Nebenrechnungen!$H$3:$J$10,3,FALSE),Nebenrechnungen!V16)))))","v":""},null,null,null,null,null,null,null,{"$f":"IF(OR(S14<=1,S14=\"\",S14=\"?\",S14=\"WP\"),\"\",\"!\")","v":""}]
[null,null,null,null,null,null,null,null,null,null,null,null,{"$f":"IF(L15=\"\",\"\",L15/$M$6)","v":""},{"$f":"IF(H16=\"\",\"\",H16-H14)","v":""},{"$f":"IF(N15=\"\",\"\",IF(N15>=0,IF(L15/$N$4*60>N15/$M$4*60,(L15/$N$4*60+N15/$M$4*30)/1440,(L15/$N$4*30+N15/$M$4*60)/1440),(IF(L15/$N$4*60>-(N15/$M$4*60),(L15/$N$4*60-N15/$M$4*30)/1440,(L15/$N$4*30-N15/$M$4*60)/1440)/$Q$3)))","v":""}]
{"$rows_left_out":28}
{"sheet":"Wetter- & Lawinenlage","index":1,"n_rows":74,"n_cols":32,"rows_kept":74,"cut":false,"hidden":false,"merged":[[21,18,21,20],[19,6,19,7],[20,6,20,7],[19,3,20,5],[19,14,20,16],[19,18,20,20],[19,11,20,12],[21,13,21,17],[21,8,21,9],[21,11,21,12],[71,3,71,4],[69,3,69,4],[70,3,70,4],[68,3,68,4],[61,6,62,6],[65,10,65,11],[61,9,61,11],[63,10,63,11],[7,3,7,7],[10,3,10,7],[11,3,12,7],[14,3,15,7],[16,3,18,7],[21,4,21,7],[5,26,6,29],[27,3,27,7],[8,22,9,23],[7,24,10,24],[25,8,26,20],[14,11,15,12],[16,18,18,20],[27,8,27,12],[19,8,19,9],[14,8,15,9],[14,18,15,20],[20,8,20,9],[14,14,15,16],[16,8,18,9],[16,11,18,16],[27,14,27,24],[75,2,79,14],[73,3,74,5],[1,8,2,20],[7,8,7,19],[10,18,12,19],[10,8,12,9],[10,10,12,10],[10,17,12,17],[10,11,12,16],[64,10,64,11],[67,16,68,19],[61,17,63,19],[66,3,66,4],[65,3,65,4],[64,3,64,4],[63,3,63,4],[36,17,37,18],[57,26,59,31],[82,26,82,27],[30,15,33,18],[34,15,35,18],[40,18,42,19],[30,19,33,21],[38,20,39,22],[46,3,46,22],[33,4,36,6],[38,18,39,19],[55,8,57,20],[58,8,62,8],[61,7,62,7],[59,12,62,12],[61,15,63,16],[69,9,72,12],[27,26,27,35],[7,26,11,29],[15,30,16,32],[13,27,14,28],[7,31,8,32],[21,26,21,32],[19,26,20,32],[33,32,34,33],[45,3,45,22],[58,6,60,7],[28,26,29,26],[28,16,29,17],[33,26,34,26],[30,26,31,26],[28,19,29,22]]}
[]
[null,null,null,null,null,null,null,null,"Munter-Rechner"]
[]
[]
[]
[null,null,null,null,null,null,null,null,null,null,null,null,null,null,null,null,null,null,null,null,null,null,null,null,null,null,"Restrisiko"]
[]
[null,null,null,"Gefahrenpotenzial:",null,null,null,null,{"$f":"IF($P$31=1,2,IF($P$31=2,4,IF($P$31=2.5,6,IF($P$31=3,8,IF($P$31=3.5,12,IF($P$31=4,16,IF($P$31=5,\"∞\")))))))","v":8},null,null,null,null,null,null,null,null,null,null,null,null,null,null,null,null,null,{"$f":"Nebenrechnungen!V28","v":0.66666666666666663},null,null,null,null,{"$f":"IF(AA20=\"\",\"\",IF(AA20=\"Hang\",\"\",IF(VLOOKUP(AA20,Nebenrechnungen!$H$3:$J$10,2,FALSE)=TRUE,VLOOKUP(AA20,Nebenrechnungen!$H$3:$J$10,3,FALSE),\"\")))","v":""}]
[null,null,null,null,null,null,null,null,null,null,null,null,null,null,null,null,null,null,null,null,null,null,"="]
[]
[null,null,null,"Reduktionsfaktoren:",null,null,null,null,null,null,null,{"$f":"IF(AND(P31>2.5,OR(I15=1,I15=\"\")),1,PRODUCT(I15,L15,O15,S15))","v":12}]
[null,null,null,{"$f":"IF(AND(I11=\"\",L11=\"\",S11=\"\"),\"\",IF(T31=2,VLOOKUP(\"gering\",Nebenrechnungen!U2:Y4,5,FALSE),IF(OR(T31=4,T31=6),VLOOKUP(\"mäßig\",Nebenrechnungen!U2:Y4,5,FALSE),IF(T31>=8,VLOOKUP(\"erheb-lich\",Nebenrechnungen!U2:Y4,5,FALSE)))))","v":"bei \"erheblich\": \nWahl eines erstklassigen Faktors zwingend notwendig und immer unter 40° bleiben."}]
[]
[null,null,null,null,null,null,null,null,null,null,{"$f":"I15","v":3},null,null,{"$f":"IF(AND(L20=\"\",O15=\"\"),\"\",MAX(L15,O15))","v":2},null,null,null,{"$f":"S15","v":2},null,null,null,null,null,null,null,null,null,{"$f":"E34","v":1800}]
[null,null,null,"Reduktionsfaktoren:",null,null,null,null,{"$f":"IF(I20=\"\",1,Nebenrechnungen!J28)","v":3},null,null,{"$f":"IF(L20=\"\",\"\",Nebenrechnungen!K28)","v":""},null,null,{"$f":"IF(I15=\"\",1,IF(O20=\"\",\"\",Nebenrechnungen!L28))","v":2},null,null,null,{"$f":"Nebenrechnungen!M28","v":2}]
{"$rows_left_out":60}
{"sheet":"130-Tage-Temperaturverlauf","index":2,"n_rows":0,"n_cols":0,"rows_kept":0,"cut":false,"hidden":false,"merged":[]}

{"sheet":"30-Tage-Temperaturverlauf","index":3,"n_rows":0,"n_cols":0,"rows_kept":0,"cut":false,"hidden":false,"merged":[]}

{"sheet":"Nebenrechnungen","index":4,"n_rows":164,"n_cols":32,"rows_kept":164,"cut":false,"hidden":true,"merged":[[0,7,0,8],[0,5,0,6],[2,16,2,17],[10,13,11,13],[10,14,10,16],[10,17,10,19],[11,9,11,12],[0,16,0,17],[0,10,0,13],[69,20,69,28],[0,3,0,4],[4,7,5,7],[4,8,5,8],[4,5,4,6],[2,5,3,5],[2,6,3,6],[4,9,5,9],[10,20,12,20],[29,0,29,5],[67,12,67,17],[68,10,78,10],[67,11,70,11],[10,22,12,22],[56,12,56,16],[10,21,12,21],[29,22,30,22],[29,18,30,18],[55,12,55,17],[47,11,47,12],[47,14,47,15]]}
["Richtung","Nein",null,"Expositionsfaktoren",null,null,null,null,null,null,"Inklinationsfaktoren",null,null,null,"Steilheits-faktor","å","Risikopotenzial",null,null,null,"Feld 1","Feld 2","Feld 3","Feld 3\n(Erläuterung)",null,"aufbauende Schneeumwandlung",null,"Anmerkung",null,"Glossar","mäßig steil",{"$f":"VLOOKUP(AE1,AD2:AE74,2,FALSE)","v":"Hangneigugung weniger als 30°"}]
["N","Ja",412,1,null,"alle Ja",{"$f":"IF(AND($B$2=\"Nein\",$B$3=\"Nein\",$B$4=\"Nein\",$B$5=\"Nein\",$B$6=\"Nein\",$B$7=\"Nein\",$B$8=\"Nein\",$B$9=\"Nein\"),1,0)","v":0},"Steilheit",5,null,"<30°","<30°",4,null,{"$f":"IF($I$2=5,0,IF($I$2=4,0,IF($I$2=3,0,IF($I$2=2,0,1))))","v":0},{"$f":"M2-O2","v":4},"unter","über",null,null,"gering",null,{"$f":"MAX(J28:M28)","v":3},null,"bei \"gering\": \nWahl beliebiger Reduktionsfaktoren",null,null,"Wegpunkt","WP","abbauende Schneeumwandlung","Neuschneekristalle vereinfachen ihre Form im Bestreben, die Kugelform zu erreichen. Damit verbunden ist eine Setzung und Verfestigung des Neuschnees"]
["NO","Ja",420,1,null,null,null,"Kammlage",{"$f":"IF('Wetter- & Lawinenlage'!$L$50=TRUE,TRUE,IF($G$9=1,TRUE,FALSE))","v":false},"**x**","30°-34°","<35°",4,{"$f":"IF(G6=1,1,G2)","v":0},{"$f":"IF($I$2=5,0,IF($I$2=4,0,IF($I$2=3,1,IF($I$2=2,3,3))))","v":0},{"$f":"IF(M3-N3-O3=0,1,M3-N3-O3)","v":4},{"$f":"'Wetter- & Lawinenlage'!E34","v":1800},null,null,null,"mäßig",{"$f":"IF(OR(J28>=M28,M28=\"\"),J28,\"\")","v":3},{"$f":"IF(J28=\"\",MAX(K28:L28),IF(OR(MAX(K28:L28)>=M28,M28=\"\"),MAX(K28:L28),\"\"))","v":2},{"$f":"IF(OR(J28=\"\",J28<M28),M28,IF(M28>MAX(K28:L28),M28,\"\"))","v":""},"bei \"mäßig\": \nWahl mindestens zweier beliebiger Reduktionsfaktoren",null,null,"Umkehr-Pkt.","UP","Abstrahlung","Aussenden von Wärmestrahlung von der Schneeoberfläche an die Atmosphäre. Bei klarem Himmel kühlt sich die Schneeoberfläche dabei deutlich (einige Grad bis rund 20 Grad) unter die Lufttemperatur ab."]
["O","Ja",421,1,null,null,null,"Rinne",{"$f":"IF('Wetter- & Lawinenlage'!$I$52=TRUE,TRUE,IF($G$9=1,TRUE,FALSE))","v":false},"**x**","35°","=35°",3,null,{"$f":"IF($I$2=5,0,IF($I$2=4,0,IF($I$2=3,0,IF($I$2=2,2,2))))","v":0},{"$f":"M4-O4","v":3},{"$f":"'Wetter- & Lawinenlage'!$U$39","v":4},{"$f":"'Wetter- & Lawinenlage'!$T$31","v":8},null,null,"erheb-lich",{"$f":"IF(J28=\"\",1,J28)","v":3},{"$f":"IF(MAX(K28:L28)=\"\",1,MAX(K28:L28))","v":2},{"$f":"IF(M28=\"\",1,M28)","v":2},"bei \"erheblich\": \nWahl eines erstklassigen Faktors zwingend notwendig und immer unter 40° bleiben.",null,null,"Entsch.-Pkt.","EP","aufbauende Schneeumwandlung","Wachstum von Schneekristallen zu kantigen Kristallen und becherartigen Hohlformen. Grosse Kristalle werden immer grösser, kleine werden aufgelöst. Führt zu einem Festigkeitsverlust in der umgewandelten Schneeschicht. Erweiterte Erklärungen: Findet v.a. in Schattenlagen, bei kleinen Schneehöhen, im Frühwinter und bei staudenartiger Vegetation statt."]
["SO","Ja",414,{"$f":"IF(OR(B5=\"Nein\",$G$2=1,$G$6=1,$G$7=1),1,3)","v":3},null,"Gefahrenquellen",null,"Übergang",{"$f":"IF('Wetter- & Lawinenlage'!$L$51=TRUE,TRUE,IF($G$9=1,TRUE,FALSE))","v":false},"**x**","35°-39°","<39°",2,null,{"$f":"IF($I$2=5,0,IF($I$2=4,0,IF($I$2=3,1,IF($I$2=2,1,1))))","v":0},{"$f":"M5-O5","v":2},null,null,null,null,null,null,null,null,null,null,null,"Neuschnee",null,"Ausapern","Abschmelzen der Schneedecke, so dass der Boden ganz oder teilweise zu Tage tritt."]
["S","Ja",413,{"$f":"IF(OR(B6=\"Nein\",$G$2=1,$G$6=1,$G$7=1),1,3)","v":3},null,"krit. Neuschnee",{"$f":"IF('Wetter- & Lawinenlage'!$AA$29=TRUE,1,0)","v":0},null,null,null,">39°",">39°",1,null,null,{"$f":"M6","v":1},null,null,null,null,null,null,null,null,null,null,null,"Triebschnee",null,"Bruchharsch","Nicht tragfähiger Harschdeckel, der bei Belastung durch Wintersportler einbricht."]
["SW","Ja",418,{"$f":"IF(OR(B7=\"Nein\",$G$2=1,$G$6=1,$G$7=1),1,3)","v":3},null,"Durchfeuchtung",{"$f":"IF('Wetter- & Lawinenlage'!$AA$31=TRUE,1,0)","v":0},"schatt.Kessel",{"$f":"IF('Wetter- & Lawinenlage'!$R$50=TRUE,TRUE,IF($G$11=1,TRUE,FALSE))","v":false},"^_^_^","gr. Gruppe / Entlastungs-abstände","1-gr.Gr.",null,null,null,null,null,null,null,null,null,null,null,null,null,null,null,"Übergang","! ! !","Bruchschicht","Schicht in der Schneedecke, in der ein Bruch im Gefüge der Schneekristalle stattgefunden hat."]
["W","Ja",415,{"$f":"IF(OR(B8=\"Nein\",$G$2=1,$G$6=1,$G$7=1),1,3)","v":3},null,"Zusatzbelast.",{"$f":"IF('Wetter- & Lawinenlage'!$AA$33=TRUE,1,0)","v":0},"schatt.Wald",{"$f":"IF('Wetter- & Lawinenlage'!$R$51=TRUE,TRUE,IF($G$11=1,TRUE,FALSE))","v":false},"^_^_^","kl. Gruppe (2-4 Pers.)","2-4",null,null,null,null,null,null,null,null,null,null,null,null,null,null,null,"Nassschnee",null,"Couloir","Steile Rinne, meist in kammnaher Lage und begrenzt von blankem Fels. Oft mit Schutt durchsetzt. Bevorzugter Ort für die Bildung von Triebschneeansammlungen."]
["NW","Ja",419,1,null,"Triebschneepakete",{"$f":"IF('Wetter- & Lawinenlage'!$AA$34=TRUE,1,0)","v":0},"schatt.Steilhang",{"$f":"IF('Wetter- & Lawinenlage'!$R$52=TRUE,TRUE,IF($G$11=1,TRUE,FALSE))","v":false},"^_^_^","kl. Gruppe / Entlastungs-abstände","1-kl.Gr.",null,null,null,null,null,null,null,null,null,null,null,null,null,null,null,"Wächten","! ! !","Durchfeuchtung","Eine durchfeuchtete Schneeschicht hat eine Temperatur von 0°C, Wasser lässt sich nicht auspressen."]
[null,null,null,null,null,"Rinne/Mulde aller Expositionen",false,"Mulde",{"$f":"IF('Wetter- & Lawinenlage'!$I$52=TRUE,TRUE,IF($G$9=1,TRUE,FALSE))","v":false},"**x**",null,null,null,null,null,null,null,null,null,null,null,null,null,null,null,null,null,"störanfällig","! ! !","Durchnässung","Eine durchnässte Schneeschicht hat eine Temperatur von 0°C. Wasser ist sichtbar und kann ausgepresst werden."]
[null,null,null,null,null,"Oberflächenreif",{"$f":"IF('Wetter- & Lawinenlage'!$AA$36=TRUE,1,0)","v":0},null,null,null,null,null,null,"gering","mäßig",null,null,"erheblich",null,null,"Risiko-potenzial entspr. Höhe","Restrisiko entspr. LWS & Höhe (Munter)","Kopie",null,null,null,null,"Spalten","! ! !","eingewehte Hangzone","Hangbereich, in den durch Wind zusätzlich Schnee eingetragen wurde."]
["Marschtabelle",null,null,null,null,null,null,null,null,"Reduktionsfaktoren",null,null,null,null,null,null,null,null,null,null,null,null,null,null,null,null,null,"Absturzgefahr","! ! !","Einstrahlung","Strahlung, die auf die Schneedecke trifft. Die kurzwellige Strahlung (sichtbares Licht) wird je nach Schneeart zu rund 90% an der Oberfläche reflektiert. Der Rest erwärmt die obersten cm der Schneedecke. Langwellige Einstrahlung (Wärmestrahlung) wird praktisch zu 100% von der Schneedecke aufgenommen."]
["n","Höhe","Exp.","Inkl.\n(Weg)","Gefahren-\nstelle","Inklination\n(Gesamt-hang)","Abstände","ständig\nbefahren","Gefahren-Exposition","Inkl.-Faktor","Exp.-Faktor","Schnee-decke","Ent-lastung","MAX\n(alle)","Größter","2.-\nGrößter","Red.\nFakt.","Feld1","Feld2","Feld3",null,null,null,"alt",null,null,null,null,null,"Eislamelle","Durch Regen oder Schmelz- und Gefrierprozesse entstandene, dünne Eisschicht in der Schneedecke, in der keine einzelnen Kornformen erkennbar sind."]
[2,{"$f":"IF(Marschtabelle!S11=0,\"\",Marschtabelle!S11)","v":""},{"$f":"IF(Marschtabelle!U11=0,\"\",Marschtabelle!U11)","v":""},{"$f":"IF(Marschtabelle!T11=0,\"\",Marschtabelle!T11)","v":""},{"$f":"IF(Marschtabelle!V11=0,\"\",Marschtabelle!V11)","v":""},{"$f":"IF(Marschtabelle!T10=0,\"\",Marschtabelle!T10)","v":""},{"$f":"IF(Marschtabelle!AA11=0,\"\",Marschtabelle!AA11)","v":""},{"$f":"IF(Marschtabelle!Z11=0,\"\",Marschtabelle!Z11)","v":""},{"$f":"IF(C14=\"\",\"\",VLOOKUP(C14,$A$2:$B$9,2,FALSE))","v":""},{"$f":"IF(U14<8,IF(D14=\"\",\"\",VLOOKUP(D14,$L$2:$M$6,2,FALSE)),IF(F14=\"\",IF(D14=\"\",\"\",VLOOKUP(D14,$L$2:$M$6,2,FALSE)),VLOOKUP(F14,$L$2:$M$6,2,FALSE)))","v":""},{"$f":"IF(OR($G$7=1,$G$6=1,AND($G$10=TRUE,OR(E14=\"Mulde\",E14=\"Rinne\"))),1,IF(AND(D14=\"\",I14>=8),1,IF(C14=\"\",1,VLOOKUP(C14,$A$2:$D$9,4,FALSE))))","v":1},{"$f":"IF(OR($G$7=1,AND($G$6=1,H14=\"nein\")),1,IF(H14=\"\",\"\",IF(H14=\"JA\",2,1)))","v":""},{"$f":"IF(G8=1,1,IF(OR($G$7=1,$G$6=1),1,IF(AND(I14>=8,D14=\"\"),1,IF(G14=\"\",\"\",IF(G14=\"1-gr.Gr.\",2,IF(G14=\"2-4\",2,IF(G14=\"1-kl.Gr.\",3,1)))))))","v":1},{"$f":"MAX(J14:M14)","v":1},{"$f":"MAX(J14:M14)","v":1},{"$f":"LARGE(J14:M14,2)","v":1},{"$f":"O14*P14","v":1},{"$f":"IF(J14=\"\",1,J14)","v":1},{"$f":"IF(MAX(K14:L14)=\"\",1,MAX(K14:L14))","v":1},{"$f":"IF(M14=\"\",1,M14)","v":1},{"$f":"IF(B14=\"\",\"\",IF(B14<$Q$3,$Q$4,$R$4))","v":""},{"$f":"IF(U14=\"\",\"\",U14/IF(U14<8,PRODUCT(IF(J14=\"\",1,J14),IF(K14=\"\",1,K14),IF(L14=\"\",1,L14),IF(M14=\"\",1,M14)),IF(OR(J14=\"\",J14<2),1,PRODUCT(IF(J14=\"\",1,J14),IF(K14=\"\",1,K14),IF(L14=\"\",1,L14),IF(M14=\"\",1,M14)))))","v":""},{"$f":"IF(U14=\"\",\"\",U14/IF(U14<8,PRODUCT(IF(J14=\"\",1,J14),IF(K14=\"\",1,K14),IF(L14=\"\",1,L14),IF(M14=\"\",1,M14)),IF(OR(J14=\"\",J14<2),1,PRODUCT(IF(J14=\"\",1,J14),IF(K14=\"\",1,K14),IF(L14=\"\",1,L14),IF(M14=\"\",1,M14)))))","v":""},{"$f":"IF(B14<$Q$3,$Q$4/IF($Q$4=2,N14,IF($Q$4=4,$Q$14,IF(R14=1,1,PRODUCT(R14,S14,T14)))),$R$4/IF($R$4=2,N14,IF($R$4=4,Q14,IF(R14=1,1,PRODUCT(R14,S14,T14)))))","v":8},null,null,null,null,null,"Entlastungsabstand","Vorsichtsmassnahme, um die Schneedecke weniger zu belasten. Im Aufstieg sollten mindestens 10 m, in der Abfahrt deutlich mehr eingehalten werden."]
[3,{"$f":"IF(Marschtabelle!S13=0,\"\",Marschtabelle!S13)","v":""},{"$f":"IF(Marschtabelle!U13=0,\"\",Marschtabelle!U13)","v":""},{"$f":"IF(Marschtabelle!T13=0,\"\",Marschtabelle!T13)","v":""},{"$f":"IF(Marschtabelle!V13=0,\"\",Marschtabelle!V13)","v":""},{"$f":"IF(Marschtabelle!X13=0,\"\",Marschtabelle!X13)","v":""},{"$f":"IF(Marschtabelle!AA13=0,\"\",Marschtabelle!AA13)","v":""},{"$f":"IF(Marschtabelle!Z13=0,\"\",Marschtabelle!Z13)","v":""},"",{"$f":"IF(U15<8,IF(D15=\"\",\"\",VLOOKUP(D15,$L$2:$M$6,2,FALSE)),IF(F15=\"\",IF(D15=\"\",\"\",VLOOKUP(D15,$L$2:$M$6,2,FALSE)),VLOOKUP(F15,$L$2:$M$6,2,FALSE)))","v":""},{"$f":"IF(OR($G$7=1,$G$6=1,AND($G$10=TRUE,OR(E15=\"Mulde\",E15=\"Rinne\"))),1,IF(AND(D15=\"\",I15>=8),1,IF(C15=\"\",1,VLOOKUP(C15,$A$2:$D$9,4,FALSE))))","v":1},"",{"$f":"IF(G8=1,1,IF(AND(I15>=8,D15=\"\"),1,IF(G15=\"\",\"\",IF(G15=\"1-gr.Gr.\",2,IF(G15=\"2-4\",2,IF(G15=\"1-kl.Gr.\",3,1))))))","v":1},1,1,1,1,1,1,1,{"$f":"IF(B15=\"\",\"\",IF(B15<$Q$3,$Q$4,$R$4))","v":""},{"$f":"IF(U15=\"\",\"\",U15/IF(U15<8,PRODUCT(IF(J15=\"\",1,J15),IF(K15=\"\",1,K15),IF(L15=\"\",1,L15),IF(M15=\"\",1,M15)),IF(OR(J15=\"\",J15<2),1,PRODUCT(IF(J15=\"\",1,J15),IF(K15=\"\",1,K15),IF(L15=\"\",1,L15),IF(M15=\"\",1,M15)))))","v":""},{"$f":"IF(U15=\"\",\"\",U15/IF(U15<8,PRODUCT(IF(J15=\"\",1,J15),IF(K15=\"\",1,K15),IF(L15=\"\",1,L15),IF(M15=\"\",1,M15)),IF(OR(J15=\"\",J15<2),1,PRODUCT(IF(J15=\"\",1,J15),IF(K15=\"\",1,K15),IF(L15=\"\",1,L15),IF(M15=\"\",1,M15)))))","v":""},null,null,null,null,null,null,"erheblich (LWS)","Lawinenwarnstufe 3 / Risikopotenzial = 8 - 12\nUngünstige Tourenbedingungen, die sehr gute Kenntnisse der Gefahrenstellen erfordern."]
{"$rows_left_out":150}
{"sheet":"Wegpunkte","index":5,"n_rows":0,"n_cols":0,"rows_kept":0,"cut":false,"hidden":true,"merged":[]}